Target
Sodium channel protein type 9 subunit alpha
Ligand
BDBM50362570
Substrate
Meas. Tech.
ChEMBL_797973 (CHEMBL1942850)
IC50
>30000±n/a nM
Citation
 Nguyen, HNBregman, HBuchanan, JLDu, BFeric, EHuang, LLi, XLigutti, JLiu, DMalmberg, ABMatson, DJMcDermott, JSPatel, VFWilenkin, BZou, AMcDonough, SIDimauro, EF Discovery and optimization of aminopyrimidinones as potent and state-dependent Nav1.7 antagonists. Bioorg Med Chem Lett 22:1055-60 (2012)  
Target
Name:
Sodium channel protein type 9 subunit alpha
Synonyms:
NENA Peripheral sodium channel 1 SCN9A_HUMAN Voltage-gated sodium channel subunit Nav1.7 hNE-Na
Type:
Protein
Mol. Mass.:
226375.97
Organism:
Homo sapiens (Human)
Description:
Q15858
Residue:
1988
  
Inhibitor
Name:
BDBM50362570
Synonyms:
CHEMBL1702732
Type:
Small organic molecule
Emp. Form.:
C12H10N4OS
Mol. Mass.:
258.299
SMILES:
Nc1cc(=O)[nH]c(SCc2ccc(cc2)C#N)n1
: