Target
Sodium-dependent serotonin transporter
Ligand
BDBM50363810
Substrate
Meas. Tech.
ChEMBL_802188 (CHEMBL1949346)
IC50
806.8±n/a nM
Citation
 Jaronczyk, MWolosewicz, KGabrielsen, MNowak, GKufareva, IMazurek, APRavna, AWAbagyan, RBojarski, AJSylte, IChilmonczyk, Z Synthesis, in vitro binding studies and docking of long-chain arylpiperazine nitroquipazine analogues, as potential serotonin transporter inhibitors. Eur J Med Chem 49:200-10 (2012)  
Target
Name:
Sodium-dependent serotonin transporter
Synonyms:
5-HT Transporter 5HT transporter Anandamid membrane transporter, AMT Monoamine transporters; Norepinephrine & serotonin Slc6a4 Sodium-dependent serotonin transporter (SERT) | imipramine receptor
Type:
Multi-pass membrane protein
Mol. Mass.:
70168.43
Organism:
Rattus norvegicus (rat)
Description:
P31652
Residue:
630
  
Inhibitor
Name:
BDBM50363810
Synonyms:
CHEMBL1945681
Type:
Small organic molecule
Emp. Form.:
C25H33N5O4
Mol. Mass.:
467.5606
SMILES:
CC1CN(CCN1CCCCN1C(=O)CC(C)(C)CC1=O)c1ccc2cc(ccc2n1)[N+]([O-])=O
: