Target
Sodium-dependent serotonin transporter
Ligand
BDBM25871
Substrate
Meas. Tech.
ChEMBL_802188 (CHEMBL1949346)
IC50
50±n/a nM
Citation
 Jaronczyk, MWolosewicz, KGabrielsen, MNowak, GKufareva, IMazurek, APRavna, AWAbagyan, RBojarski, AJSylte, IChilmonczyk, Z Synthesis, in vitro binding studies and docking of long-chain arylpiperazine nitroquipazine analogues, as potential serotonin transporter inhibitors. Eur J Med Chem 49:200-10 (2012)  
Target
Name:
Sodium-dependent serotonin transporter
Synonyms:
5-HT Transporter 5HT transporter Anandamid membrane transporter, AMT Monoamine transporters; Norepinephrine & serotonin Slc6a4 Sodium-dependent serotonin transporter (SERT) | imipramine receptor
Type:
Multi-pass membrane protein
Mol. Mass.:
70168.43
Organism:
Rattus norvegicus (rat)
Description:
P31652
Residue:
630
  
Inhibitor
Name:
BDBM25871
Synonyms:
1-{4-[2-methyl-4-(quinolin-2-yl)piperazin-1-yl]butyl}piperidine-2,6-dione | buspirone analogue, 2
Type:
Small organic molecule
Emp. Form.:
C23H30N4O2
Mol. Mass.:
394.5099
SMILES:
CC1CN(CCN1CCCCN1C(=O)CCCC1=O)c1ccc2ccccc2n1
: