Target
Diacylglycerol O-acyltransferase 1
Ligand
BDBM27947
Substrate
Meas. Tech.
ChEMBL_803189 (CHEMBL1954900)
IC50
72±n/a nM
Citation
 Dow, RLLi, JCPence, MPGibbs, EMLaPerle, JLLitchfield, JPiotrowski, DWMunchhof, MJManion, TBZavadoski, WJWalker, GSMcPherson, RKTapley, SSugarman, EGuzman-Perez, ADaSilva-Jardine, P Discovery of PF-04620110, a Potent, Selective, and Orally Bioavailable Inhibitor of DGAT-1. ACS Med Chem Lett 2:407-412 (2011)  
Target
Name:
Diacylglycerol O-acyltransferase 1
Synonyms:
ACAT-related gene product 1 Acyl coA-diacylglycerol acyl transferase 1 (DGAT1) DGAT1 Diacylglycerol Acyltransferase (DGAT1) Diacylglycerol O-acyltransferase 1 (DGAT1) | Diglyceride acyltransferase
Type:
Protein
Mol. Mass.:
55297.82
Organism:
Homo sapiens (Human)
Description:
O75907
Residue:
488
  
Inhibitor
Name:
BDBM27947
Synonyms:
2-[4-(4-{4-amino-7,7-dimethyl-7H-pyrimido[4,5-b][1,4]oxazin-6-yl}phenyl)cyclohexyl]acetic acid | pyrimido[4,5-b][1,4]oxazine derivative, 2
Type:
Small organic molecule
Emp. Form.:
C22H26N4O3
Mol. Mass.:
394.4668
SMILES:
CC1(C)Oc2ncnc(N)c2N=C1c1ccc(cc1)[C@H]1CC[C@H](CC(O)=O)CC1
: