Target
Diacylglycerol O-acyltransferase 1
Ligand
BDBM50355142
Substrate
Meas. Tech.
ChEMBL_803191 (CHEMBL1954902)
IC50
8±n/a nM
Citation
 Dow, RLLi, JCPence, MPGibbs, EMLaPerle, JLLitchfield, JPiotrowski, DWMunchhof, MJManion, TBZavadoski, WJWalker, GSMcPherson, RKTapley, SSugarman, EGuzman-Perez, ADaSilva-Jardine, P Discovery of PF-04620110, a Potent, Selective, and Orally Bioavailable Inhibitor of DGAT-1. ACS Med Chem Lett 2:407-412 (2011)  
Target
Name:
Diacylglycerol O-acyltransferase 1
Synonyms:
ACAT-related gene product 1 Acyl coA-diacylglycerol acyl transferase 1 (DGAT1) DGAT1 Diacylglycerol Acyltransferase (DGAT1) Diacylglycerol O-acyltransferase 1 (DGAT1) | Diglyceride acyltransferase
Type:
Protein
Mol. Mass.:
55297.82
Organism:
Homo sapiens (Human)
Description:
O75907
Residue:
488
  
Inhibitor
Name:
BDBM50355142
Synonyms:
CHEMBL1835919
Type:
Small organic molecule
Emp. Form.:
C21H24N4O4
Mol. Mass.:
396.4397
SMILES:
Nc1ncnc2OCCN(c3ccc(cc3)[C@H]3CC[C@H](CC(O)=O)CC3)C(=O)c12
: