Target
D(1B) dopamine receptor
Ligand
BDBM50363963
Substrate
Meas. Tech.
ChEMBL_803949 (CHEMBL1954780)
Ki
4.4±n/a nM
Citation
 Robaa, DEnzensperger, CEldin Abulazm, SHefnawy, MMEl-Subbagh, HIWani, TALehmann, J Chiral indolo[3,2-f][3]benzazecine-type dopamine receptor antagonists: synthesis and activity of racemic and enantiopure derivatives. J Med Chem 54:7422-6 (2011)  
Target
Name:
D(1B) dopamine receptor
Synonyms:
D(5) dopamine receptor DOPAMINE D5 DRD1L2 DRD5_HUMAN | dopamine receptor D5
Type:
Protein
Mol. Mass.:
52943.41
Organism:
Homo sapiens (Human)
Description:
P21918
Residue:
477
  
Inhibitor
Name:
BDBM50363963
Synonyms:
CHEMBL1949725
Type:
Small organic molecule
Emp. Form.:
C21H24N2
Mol. Mass.:
304.4287
SMILES:
C[C@H]1Cc2c(Cc3ccccc3CCN1C)[nH]c1ccccc21
: