Target
Potassium voltage-gated channel subfamily H member 2
Ligand
BDBM50228403
Substrate
Meas. Tech.
ChEMBL_803863 (CHEMBL1954401)
IC50
>30000±n/a nM
Citation
 Sutton, JMClark, DEDunsdon, SJFenton, GFillmore, AHarris, NVHiggs, CHurley, CAKrintel, SLMacKenzie, REDuttaroy, AGangl, EManiara, WSedrani, RNamoto, KOstermann, NGerhartz, BSirockin, FTrappe, JHassiepen, UBaeschlin, DK Novel heterocyclic DPP-4 inhibitors for the treatment of type 2 diabetes. Bioorg Med Chem Lett 22:1464-8 (2012)  
Target
Name:
Potassium voltage-gated channel subfamily H member 2
Synonyms:
1,3-beta-glucan synthase component GLS2 ERG Eag-related protein 1 Ether-a-go-go-related gene (HERG) Ether-a-go-go-related gene potassium channel 1 Ether-a-go-go-related gene potassium channel 1 (hERG1) Ether-a-go-go-related protein 1 H-ERG KCNH2 Potassium voltage-gated channel subfamily H member 2 (hERG) Voltage-gated potassium channel subunit Kv11.1 hERG Potassium Channel 1 | putative potassium channel subunit
Type:
Multi-pass membrane protein
Mol. Mass.:
126672.65
Organism:
Homo sapiens (Human)
Description:
Q12809
Residue:
1159
  
Inhibitor
Name:
BDBM50228403
Synonyms:
(R)-8-(3-aminopiperidin-1-yl)-7-(but-2-ynyl)-3-methyl-1-((4-methylquinazolin-2-yl)methyl)-1H-purine-2,6(3H,7H)-dione CHEMBL237500 US10202383, Example 2(142) US9255098, Linagliptin US9556175, 2(142)
Type:
Small organic molecule
Emp. Form.:
C25H28N8O2
Mol. Mass.:
472.5422
SMILES:
CC#CCn1c(nc2n(C)c(=O)n(Cc3nc(C)c4ccccc4n3)c(=O)c12)N1CCC[C@@H](N)C1
: