Target
Carbonic anhydrase
Ligand
BDBM26980
Substrate
Meas. Tech.
ChEMBL_804821 (CHEMBL1953640)
Ki
30600000±n/a nM
Citation
 Ohradanova, AVullo, DPastorekova, SPastorek, JJackson, DJWörheide, GSupuran, CT Anion inhibition studies of ana-carbonic anhydrase from the living fossil Astrosclera willeyana. Bioorg Med Chem Lett 22:1314-6 (2012)  
Target
Name:
Carbonic anhydrase
Synonyms:
Astrosclerin-3
Type:
PROTEIN
Mol. Mass.:
33233.07
Organism:
Astrosclera willeyana
Description:
ChEMBL_801827
Residue:
292
  
Inhibitor
Name:
BDBM26980
Synonyms:
Br- CHEMBL1644694 bromide ion
Type:
Ion
Emp. Form.:
Br
Mol. Mass.:
79.905
SMILES:
[Br-]
: