Target
cAMP and cAMP-inhibited cGMP 3',5'-cyclic phosphodiesterase 10A
Ligand
BDBM50364327
Substrate
Meas. Tech.
ChEMBL_804822 (CHEMBL1953641)
Ki
0.07±n/a nM
Citation
 McElroy, WTTan, ZBasu, KYang, SWSmotryski, JHo, GDTulshian, DGreenlee, WJMullins, DGuzzi, MZhang, XBleickardt, CHodgson, R Pyrazoloquinolines as PDE10A inhibitors: discovery of a tool compound. Bioorg Med Chem Lett 22:1335-9 (2012)  
Target
Name:
cAMP and cAMP-inhibited cGMP 3',5'-cyclic phosphodiesterase 10A
Synonyms:
3',5'-cyclic phosphodiesterase PDE10_HUMAN Phosphodiesterase 10A
Type:
Protein
Mol. Mass.:
88412.52
Organism:
Homo sapiens (Human)
Description:
Q9Y233
Residue:
779
  
Inhibitor
Name:
BDBM50364327
Synonyms:
CHEMBL1949939
Type:
Small organic molecule
Emp. Form.:
C19H17FN4O2
Mol. Mass.:
352.3623
SMILES:
COc1cc(C)c2nc3[nH]nc(C)c3c(C(O)c3ccnc(F)c3)c2c1
: