Target
Transient receptor potential cation channel subfamily V member 1
Ligand
BDBM20461
Substrate
Meas. Tech.
ChEMBL_802410 (CHEMBL1954853)
EC50
3.9±n/a nM
Citation
 Morera, EDe Petrocellis, LMorera, LMoriello, ASNalli, MDi Marzo, VOrtar, G Synthesis and biological evaluation of [6]-gingerol analogues as transient receptor potential channel TRPV1 and TRPA1 modulators. Bioorg Med Chem Lett 22:1674-7 (2012)  
Target
Name:
Transient receptor potential cation channel subfamily V member 1
Synonyms:
Capsaicin receptor Osm-9-like TRP channel 1 TRPV1_HUMAN Transient receptor potential cation channel subfamily V member 1 (TRPV1) Transient receptor potential cation channel subfamily V member 1(TRPV1) Vanilloid VR1 Vanilloid receptor 1 Vanilloid receptor 1 (VRI/TRPV1)
Type:
Protein
Mol. Mass.:
94960.75
Organism:
Homo sapiens (Human)
Description:
Q8NER1
Residue:
839
  
Inhibitor
Name:
BDBM20461
Synonyms:
(6E)-N-[(4-hydroxy-3-methoxyphenyl)methyl]-8-methylnon-6-enamide CAP Capsaicin | Zostrix
Type:
Emp. Form.:
C18H27NO3
Mol. Mass.:
305.4119
SMILES:
COc1cc(CNC(=O)CCCC\C=C\C(C)C)ccc1O
: