Target
Cannabinoid receptor 1
Ligand
BDBM50364936
Substrate
Meas. Tech.
ChEMBL_804070 (CHEMBL1952635)
EC50
150±n/a nM
Citation
 Cheng, YXPourashraf, MLuo, XSrivastava, SWalpole, CSalois, DSt-Onge, SPayza, KLessard, EYu, XHTomaszewski, MJ ¿-Carbolines: a novel class of cannabinoid agonists with high aqueous solubility and restricted CNS penetration. Bioorg Med Chem Lett 22:1619-24 (2012)  
Target
Name:
Cannabinoid receptor 1
Synonyms:
CANN6 CB-R CNR CNR1_HUMAN Cannabinoid receptor Cannabinoid receptor 1 (brain)
Type:
G Protein-Coupled Receptor (GPCR)
Mol. Mass.:
52868.96
Organism:
Homo sapiens (Human)
Description:
P21554
Residue:
472
  
Inhibitor
Name:
BDBM50364936
Synonyms:
CHEMBL1950352
Type:
Small organic molecule
Emp. Form.:
C26H37N3O4S
Mol. Mass.:
487.655
SMILES:
CC(C)S(=O)(=O)n1c2CCN(Cc2c2cc(ccc12)C(=O)N1CCC(C)CC1)C1CCOCC1
: