Target
Cannabinoid receptor 1
Ligand
BDBM50364939
Substrate
Meas. Tech.
ChEMBL_804069 (CHEMBL1952464)
Ki
110±n/a nM
Citation
 Cheng, YXPourashraf, MLuo, XSrivastava, SWalpole, CSalois, DSt-Onge, SPayza, KLessard, EYu, XHTomaszewski, MJ ¿-Carbolines: a novel class of cannabinoid agonists with high aqueous solubility and restricted CNS penetration. Bioorg Med Chem Lett 22:1619-24 (2012)  
Target
Name:
Cannabinoid receptor 1
Synonyms:
CANN6 CB-R CNR CNR1_HUMAN Cannabinoid receptor Cannabinoid receptor 1 (brain)
Type:
G Protein-Coupled Receptor (GPCR)
Mol. Mass.:
52868.96
Organism:
Homo sapiens (Human)
Description:
P21554
Residue:
472
  
Inhibitor
Name:
BDBM50364939
Synonyms:
CHEMBL1950355
Type:
Small organic molecule
Emp. Form.:
C25H36N4O4S
Mol. Mass.:
488.643
SMILES:
CC1CCN(CC1)C(=O)c1ccc2n(c3CCN(Cc3c2c1)C1CCOCC1)S(=O)(=O)N(C)C
: