Target
Cytochrome P450 3A4
Ligand
BDBM50364920
Substrate
Meas. Tech.
ChEMBL_804279 (CHEMBL1954293)
IC50
>20000±n/a nM
Citation
 Cheng, YXPourashraf, MLuo, XSrivastava, SWalpole, CSalois, DSt-Onge, SPayza, KLessard, EYu, XHTomaszewski, MJ ¿-Carbolines: a novel class of cannabinoid agonists with high aqueous solubility and restricted CNS penetration. Bioorg Med Chem Lett 22:1619-24 (2012)  
Target
Name:
Cytochrome P450 3A4
Synonyms:
Albendazole monooxygenase CP3A4_HUMAN CYP3A4 CYPIIIA4 Cytochrome P450 3A4 (CYP3A4) Nifedipine oxidase Taurochenodeoxycholate 6-alpha-hydroxylase
Type:
Enzyme
Mol. Mass.:
57349.57
Organism:
Homo sapiens (Human)
Description:
Residue:
503
  
Inhibitor
Name:
BDBM50364920
Synonyms:
CHEMBL1950351
Type:
Small organic molecule
Emp. Form.:
C25H35N3O4S
Mol. Mass.:
473.628
SMILES:
CCS(=O)(=O)n1c2CCN(Cc2c2cc(ccc12)C(=O)N1CCC(C)CC1)C1CCOCC1
: