Target
Histamine H3 receptor
Ligand
BDBM50352798
Substrate
Meas. Tech.
ChEMBL_804457 (CHEMBL1952467)
Ki
2.4±n/a nM
Citation
 Hudkins, RLZulli, ALDandu, RrTao, MJosef, KAAimone, LDHaltiwanger, RCHuang, ZLyons, JAMathiasen, JRRaddatz, RGruner, JA 4-phenoxypiperidine pyridazin-3-one histamine H(3) receptor inverse agonists demonstrating potent and robust wake promoting activity. Bioorg Med Chem Lett 22:1504-9 (2012)  
Target
Name:
Histamine H3 receptor
Synonyms:
G-protein coupled receptor 97 HH3R HRH3 Histamine H3 receptor (H3) Histamine receptor (H3 and H4)
Type:
G Protein-Coupled Receptor (GPCR)
Mol. Mass.:
48691.47
Organism:
Homo sapiens (Human)
Description:
Binding assays were using CHO cells stably expressing hH3R receptors.
Residue:
445
  
Inhibitor
Name:
BDBM50352798
Synonyms:
CHEMBL1823402
Type:
Small organic molecule
Emp. Form.:
C20H25N3O2
Mol. Mass.:
339.4314
SMILES:
Cn1nc(ccc1=O)-c1ccc(OC2CCN(CC2)C2CCC2)cc1
: