Target
Integrin alpha-IIb/beta-3
Ligand
BDBM50365352
Substrate
Meas. Tech.
ChEMBL_806672 (CHEMBL1960314)
EC50
276±n/a nM
Citation
 Bollinger, MManzenrieder, FKolb, RBochen, ANeubauer, SMarinelli, LLimongelli, VNovellino, EMoessmer, GPell, RLindner, WFanous, JHoffman, AKessler, H Tailoring of integrin ligands: probing the charge capability of the metal ion-dependent adhesion site. J Med Chem 55:871-82 (2012)  
Target
Name:
Integrin alpha-IIb/beta-3
Synonyms:
Glycoprotein IIb/IIIa
Type:
Mol. Mass.:
Description:
ASSAY_ID of EBI is 30109
Components:
This complex has 2 components.
Component 1
Name:
Integrin beta-3
Synonyms:
CD_antigen=CD61 GPIIIa ITGB3 Platelet membrane glycoprotein IIIa
Type:
Protein
Mol. Mass.:
87038.91
Organism:
Homo sapiens (Human)
Description:
P05106
Residue:
788
  
Component 2
Name:
Integrin alpha-IIb
Synonyms:
CD_antigen=CD41 GPIIb Glycoprotein IIb ITGA2B Integrin alpha-IIb heavy chain Integrin alpha-IIb light chain, form 2 Integrin alpha-V/beta-3 and alpha-IIb/beta 3 | Platelet membrane glycoprotein IIb
Type:
Protein
Mol. Mass.:
113354.85
Organism:
Homo sapiens (Human)
Description:
P08514
Residue:
1039
  
Inhibitor
Name:
BDBM50365352
Synonyms:
CHEMBL1956152
Type:
Small organic molecule
Emp. Form.:
C22H30N3O7PS
Mol. Mass.:
511.528
SMILES:
OP(O)(=O)[C@H](CNC(=O)c1ccc(OCCC2CCNCC2)cc1)NS(=O)(=O)c1ccccc1
: