Target
Platelet-derived growth factor receptor beta
Ligand
BDBM50355491
Substrate
Meas. Tech.
ChEMBL_806853 (CHEMBL1958981)
Ki
200±n/a nM
Citation
 Heidary, DKHuang, GBoucher, DMa, JForster, CGrey, RXu, JArnost, MChoquette, DChen, GZhou, JHYao, YMBall, EDNamchuk, MDavies, RJHenkel, G VX-322: a novel dual receptor tyrosine kinase inhibitor for the treatment of acute myelogenous leukemia. J Med Chem 55:725-34 (2012)  
Target
Name:
Platelet-derived growth factor receptor beta
Synonyms:
Beta-type platelet-derived growth factor receptor CD140b antigen PDGF Receptor Substrate PDGFR PDGFR-1 PDGFRB PGFRB_HUMAN Platelet-derived growth factor receptor 1 Platelet-derived growth factor receptor beta (PDGFR-beta) Platelet-derived growth factor receptor beta (PDGFRbeta) | VHL/PDGFRB
Type:
Enzyme
Mol. Mass.:
123922.25
Organism:
Homo sapiens (Human)
Description:
P09619
Residue:
1106
  
Inhibitor
Name:
BDBM50355491
Synonyms:
CHEMBL1835870
Type:
Small organic molecule
Emp. Form.:
C23H29N7O
Mol. Mass.:
419.5227
SMILES:
Nc1nc(Nc2ccc(cc2)[C@H]2CC[C@@H](CC2)N2CCOCC2)nn1-c1ccccn1
: