Target
Mast/stem cell growth factor receptor Kit
Ligand
BDBM50355480
Substrate
Meas. Tech.
ChEMBL_806855 (CHEMBL1958983)
IC50
18±n/a nM
Citation
 Heidary, DKHuang, GBoucher, DMa, JForster, CGrey, RXu, JArnost, MChoquette, DChen, GZhou, JHYao, YMBall, EDNamchuk, MDavies, RJHenkel, G VX-322: a novel dual receptor tyrosine kinase inhibitor for the treatment of acute myelogenous leukemia. J Med Chem 55:725-34 (2012)  
Target
Name:
Mast/stem cell growth factor receptor Kit
Synonyms:
CD117 antigen KIT Mast/stem cell growth factor receptor Kit (cKIT) Proto-oncogene tyrosine-protein kinase Kit Stem cell growth factor receptor Tyrosine-protein kinase Kit c-kit v-kit Hardy-Zuckerman 4 feline sarcoma viral oncogene homolog
Type:
Protein
Mol. Mass.:
109869.37
Organism:
Homo sapiens (Human)
Description:
P10721
Residue:
976
  
Inhibitor
Name:
BDBM50355480
Synonyms:
CHEMBL1835747
Type:
Small organic molecule
Emp. Form.:
C17H19N7O
Mol. Mass.:
337.3791
SMILES:
Nc1nc(Nc2ccc(cc2)N2CCOCC2)nn1-c1ccccn1
: