Target
cAMP and cAMP-inhibited cGMP 3',5'-cyclic phosphodiesterase 10A
Ligand
BDBM50365476
Substrate
Meas. Tech.
ChEMBL_807649 (CHEMBL1960211)
IC50
12±n/a nM
Citation
 Bauer, UGiordanetto, FBauer, MO'Mahony, GJohansson, KEKnecht, WHartleib-Geschwindner, JCarlsson, ETEnroth, C Discovery of 4-hydroxy-1,6-naphthyridine-3-carbonitrile derivatives as novel PDE10A inhibitors. Bioorg Med Chem Lett 22:1944-8 (2012)  
Target
Name:
cAMP and cAMP-inhibited cGMP 3',5'-cyclic phosphodiesterase 10A
Synonyms:
3',5'-cyclic phosphodiesterase PDE10_HUMAN Phosphodiesterase 10A
Type:
Protein
Mol. Mass.:
88412.52
Organism:
Homo sapiens (Human)
Description:
Q9Y233
Residue:
779
  
Inhibitor
Name:
BDBM50365476
Synonyms:
CHEMBL1957361
Type:
Small organic molecule
Emp. Form.:
C23H17N3O2
Mol. Mass.:
367.4
SMILES:
CCOc1ccccc1-c1ccc(cc1)-c1nc2ccncc2c(O)c1C#N
: