Target
Sphingosine 1-phosphate receptor 4
Ligand
BDBM50364607
Substrate
Meas. Tech.
ChEMBL_806055 (CHEMBL1960572)
EC50
58±n/a nM
Citation
 Nakamura, TAsano, MSekiguchi, YMizuno, YTamaki, KNara, FKawase, YYabe, YNakai, DKamiyama, EUrasaki-Kaneno, YShimozato, TDoi-Komuro, HKagari, TTomisato, WInoue, RNagasaki, MYuita, HOguchi-Oshima, KKaneko, RNishi, T Synthesis and evaluation of CS-2100, a potent, orally active and S1P(3)- sparing S1P(1) agonist. Eur J Med Chem 51:92-8 (2012)  
Target
Name:
Sphingosine 1-phosphate receptor 4
Synonyms:
EDG6 S1P receptor 4 S1P4 S1PR4_HUMAN Sphingosine 1-phosphate receptor Edg-6 sphingosine-1-phosphate 4 S1P4
Type:
G Protein-Coupled Receptor (GPCR)
Mol. Mass.:
41647.39
Organism:
Homo sapiens (Human)
Description:
Residue:
384
  
Inhibitor
Name:
BDBM50364607
Synonyms:
CHEMBL1951304
Type:
Small organic molecule
Emp. Form.:
C25H23N3O4S
Mol. Mass.:
461.533
SMILES:
CCc1cc(CN2CC(C2)C(O)=O)sc1-c1noc(n1)-c1ccc(Oc2ccccc2)cc1
: