Target
D(2) dopamine receptor
Ligand
BDBM50137981
Substrate
Meas. Tech.
ChEBML_62880
Ki
0.430000±n/a nM
Citation
 Campiani, GButini, SFattorusso, CCatalanotti, BGemma, SNacci, VMorelli, ECagnotto, AMereghetti, IMennini, TCarli, MMinetti, PDi Cesare, MAMastroianni, DScafetta, NGalletti, BStasi, MACastorina, MPacifici, LVertechy, MDi Serio, SGhirardi, OTinti, OCarminati, P Pyrrolo[1,3]benzothiazepine-based serotonin and dopamine receptor antagonists. Molecular modeling, further structure-activity relationship studies, and identification of novel atypical antipsychotic agents. J Med Chem 47:143-57 (2003)  
Target
Name:
D(2) dopamine receptor
Synonyms:
DOPAMINE D2 DOPAMINE D2 Short Dopamine D2 receptor Drd2
Type:
G Protein-Coupled Receptor (GPCR)
Mol. Mass.:
50931.60
Organism:
Rattus norvegicus (rat)
Description:
P61169
Residue:
444
  
Inhibitor
Name:
BDBM50137981
Synonyms:
7-Chloro-9-(4-methyl-piperazin-1-yl)-4-thia-10a-aza-benzo[f]azulene | CHEMBL426763
Type:
Small organic molecule
Emp. Form.:
C17H18ClN3S
Mol. Mass.:
331.863
SMILES:
CN1CCN(CC1)C1=Cn2cccc2Sc2ccc(Cl)cc12
: