Target
5-hydroxytryptamine receptor 2A
Ligand
BDBM50007568
Substrate
Meas. Tech.
ChEBML_2670
Ki
0.140000±n/a nM
Citation
 Campiani, GButini, SFattorusso, CCatalanotti, BGemma, SNacci, VMorelli, ECagnotto, AMereghetti, IMennini, TCarli, MMinetti, PDi Cesare, MAMastroianni, DScafetta, NGalletti, BStasi, MACastorina, MPacifici, LVertechy, MDi Serio, SGhirardi, OTinti, OCarminati, P Pyrrolo[1,3]benzothiazepine-based serotonin and dopamine receptor antagonists. Molecular modeling, further structure-activity relationship studies, and identification of novel atypical antipsychotic agents. J Med Chem 47:143-57 (2003)  
Target
Name:
5-hydroxytryptamine receptor 2A
Synonyms:
5-HT-2A 5-HT2A 5-hydroxytryptamine receptor 2A (5HT2A) Htr2 Serotonin Receptor 2A
Type:
G Protein-Coupled Receptor (GPCR)
Mol. Mass.:
52852.05
Organism:
Rattus norvegicus (rat)
Description:
Rat cortex membranes 5-HT2A receptors.
Residue:
471
  
Inhibitor
Name:
BDBM50007568
Synonyms:
1-((S)-8-Chloro-10,11-dihydro-dibenzo[b,f]thiepin-10-yl)-4-methyl-piperazine CHEMBL303313 | OCTOCLOTHEPIN-S
Type:
Small organic molecule
Emp. Form.:
C19H21ClN2S
Mol. Mass.:
344.901
SMILES:
CN1CCN(CC1)[C@H]1Cc2ccccc2Sc2ccc(Cl)cc12
: