Target
Tissue alpha-L-fucosidase
Ligand
BDBM50403109
Substrate
Meas. Tech.
ChEMBL_33962 (CHEMBL649587)
Ki
35000000±n/a nM
Citation
 Dumas, DPKajimoto, TLiu, KKWong, CBerkowitz, DBDanieshefsky, SJ Azasugar and glycal inhibitors of -L-fucosidase Bioorg Med Chem Lett 2:33-36 (1992)    Article 
Target
Name:
Tissue alpha-L-fucosidase
Synonyms:
Alpha-L-fucosidase I FUCA1 Tissue alpha-L-fucosidase
Type:
PROTEIN
Mol. Mass.:
53690.69
Organism:
Homo sapiens (Human)
Description:
ChEMBL_34088
Residue:
466
  
Inhibitor
Name:
BDBM50403109
Synonyms:
CHEMBL2115527
Type:
Small organic molecule
Emp. Form.:
C6H10O3
Mol. Mass.:
130.1418
SMILES:
C[C@H]1OC=C[C@@H](O)[C@H]1O
: