Target
Tissue alpha-L-fucosidase
Ligand
BDBM50280039
Substrate
Meas. Tech.
ChEMBL_33962 (CHEMBL649587)
Ki
83000000±n/a nM
Citation
 Dumas, DPKajimoto, TLiu, KKWong, CBerkowitz, DBDanieshefsky, SJ Azasugar and glycal inhibitors of -L-fucosidase Bioorg Med Chem Lett 2:33-36 (1992)    Article 
Target
Name:
Tissue alpha-L-fucosidase
Synonyms:
Alpha-L-fucosidase I FUCA1 Tissue alpha-L-fucosidase
Type:
PROTEIN
Mol. Mass.:
53690.69
Organism:
Homo sapiens (Human)
Description:
ChEMBL_34088
Residue:
466
  
Inhibitor
Name:
BDBM50280039
Synonyms:
2-Phenyl-3,4-dihydro-2H-pyran-3,4-diol | CHEMBL120792
Type:
Small organic molecule
Emp. Form.:
C11H12O3
Mol. Mass.:
192.2112
SMILES:
OC1C=COC(C1O)c1ccccc1
: