Target
Tissue alpha-L-fucosidase
Ligand
BDBM18351
Substrate
Meas. Tech.
ChEBML_33962
Ki
>100000000±n/a nM
Citation
 Dumas, DPKajimoto, TLiu, KKWong, CBerkowitz, DBDanieshefsky, SJ Azasugar and glycal inhibitors of -L-fucosidase Bioorg Med Chem Lett 2:33-36 (1992)    Article 
Target
Name:
Tissue alpha-L-fucosidase
Synonyms:
Alpha-L-fucosidase I FUCA1 Tissue alpha-L-fucosidase
Type:
PROTEIN
Mol. Mass.:
53690.69
Organism:
Homo sapiens (Human)
Description:
ChEMBL_34088
Residue:
466
  
Inhibitor
Name:
BDBM18351
Synonyms:
(2R,3R,4R,5S)-2-(Hydroxymethyl)piperidine-3,4,5-triol, 10 1-Deoxynojirimycin CHEMBL307429 US9181184, 1 | dNM
Type:
natural product
Emp. Form.:
C6H13NO4
Mol. Mass.:
163.1717
SMILES:
OC[C@H]1NC[C@H](O)[C@@H](O)[C@@H]1O
: