Target
Tissue alpha-L-fucosidase
Ligand
BDBM50280034
Substrate
Meas. Tech.
ChEBML_33962
Ki
>100000000±n/a nM
Citation
 Dumas, DPKajimoto, TLiu, KKWong, CBerkowitz, DBDanieshefsky, SJ Azasugar and glycal inhibitors of -L-fucosidase Bioorg Med Chem Lett 2:33-36 (1992)    Article 
Target
Name:
Tissue alpha-L-fucosidase
Synonyms:
Alpha-L-fucosidase I FUCA1 Tissue alpha-L-fucosidase
Type:
PROTEIN
Mol. Mass.:
53690.69
Organism:
Homo sapiens (Human)
Description:
ChEMBL_34088
Residue:
466
  
Inhibitor
Name:
BDBM50280034
Synonyms:
1-(4-Hydroxy-2-phenyl-3,4-dihydro-2H-pyran-3-yl)-ethanone | CHEMBL275255
Type:
Small organic molecule
Emp. Form.:
C13H14O3
Mol. Mass.:
218.2485
SMILES:
CC(=O)C1C(O)C=COC1c1ccccc1
: