Target
Tissue alpha-L-fucosidase
Ligand
BDBM50037814
Substrate
Meas. Tech.
ChEBML_33962
Ki
910000±n/a nM
Citation
 Dumas, DPKajimoto, TLiu, KKWong, CBerkowitz, DBDanieshefsky, SJ Azasugar and glycal inhibitors of -L-fucosidase Bioorg Med Chem Lett 2:33-36 (1992)    Article 
Target
Name:
Tissue alpha-L-fucosidase
Synonyms:
Alpha-L-fucosidase I FUCA1 Tissue alpha-L-fucosidase
Type:
PROTEIN
Mol. Mass.:
53690.69
Organism:
Homo sapiens (Human)
Description:
ChEMBL_34088
Residue:
466
  
Inhibitor
Name:
BDBM50037814
Synonyms:
2,5-Bis-hydroxymethyl-pyrrolidine-3,4-diol | CHEMBL121093
Type:
Small organic molecule
Emp. Form.:
C6H13NO4
Mol. Mass.:
163.1717
SMILES:
OCC1NC(CO)C(O)C1O
: