Target
Tissue alpha-L-fucosidase
Ligand
BDBM50280037
Substrate
Meas. Tech.
ChEBML_33962
Ki
>100000000±n/a nM
Citation
 Dumas, DPKajimoto, TLiu, KKWong, CBerkowitz, DBDanieshefsky, SJ Azasugar and glycal inhibitors of -L-fucosidase Bioorg Med Chem Lett 2:33-36 (1992)    Article 
Target
Name:
Tissue alpha-L-fucosidase
Synonyms:
Alpha-L-fucosidase I FUCA1 Tissue alpha-L-fucosidase
Type:
PROTEIN
Mol. Mass.:
53690.69
Organism:
Homo sapiens (Human)
Description:
ChEMBL_34088
Residue:
466
  
Inhibitor
Name:
BDBM50280037
Synonyms:
3-Benzyloxy-2-phenyl-3,4-dihydro-2H-pyran-4-ol | CHEMBL120027
Type:
Small organic molecule
Emp. Form.:
C18H18O3
Mol. Mass.:
282.3337
SMILES:
OC1C=COC(C1OCc1ccccc1)c1ccccc1
: