Target
Tissue alpha-L-fucosidase
Ligand
BDBM50242419
Substrate
Meas. Tech.
ChEBML_33962
Ki
300000±n/a nM
Citation
 Dumas, DPKajimoto, TLiu, KKWong, CBerkowitz, DBDanieshefsky, SJ Azasugar and glycal inhibitors of -L-fucosidase Bioorg Med Chem Lett 2:33-36 (1992)    Article 
Target
Name:
Tissue alpha-L-fucosidase
Synonyms:
Alpha-L-fucosidase I FUCA1 Tissue alpha-L-fucosidase
Type:
PROTEIN
Mol. Mass.:
53690.69
Organism:
Homo sapiens (Human)
Description:
ChEMBL_34088
Residue:
466
  
Inhibitor
Name:
BDBM50242419
Synonyms:
6-Deoxy-L-galactose CHEMBL469449 L-fucose
Type:
Small organic molecule
Emp. Form.:
C6H12O5
Mol. Mass.:
164.1565
SMILES:
C[C@@H]1OC(O)[C@@H](O)[C@H](O)[C@@H]1O
: