Target
Substance-P receptor
Ligand
BDBM50001447
Substrate
Meas. Tech.
ChEBML_205417
IC50
3.5±n/a nM
Citation
 Howson, WHodgson, JRichardson, RWalton, LGuard, SWatling, K An SAR study for the non-peptide substance P receptor (NK1) antagonist, CP-96,345. Bioorg Med Chem Lett 2:559-564 (1992)    Article 
Target
Name:
Substance-P receptor
Synonyms:
NK1R_CAVPO Neurokinin NK1 TACR1
Type:
Enzyme Catalytic Domain
Mol. Mass.:
46261.42
Organism:
GUINEA PIG
Description:
Neurokinin NK1 TACR1 GUINEA PIG::P30547
Residue:
407
  
Inhibitor
Name:
BDBM50001447
Synonyms:
CHEMBL217406 His-Lys-Thr-Asp-Ser-Phe-Val-Gly-Leu-Met-NH2(NeurokininA)
Type:
Small organic molecule
Emp. Form.:
C50H80N14O14S
Mol. Mass.:
1133.321
SMILES:
CSCC[C@H](NC(=O)[C@H](CC(C)C)NC(=O)CNC(=O)[C@@H](NC(=O)[C@H](Cc1ccccc1)NC(=O)[C@H](CO)NC(=O)[C@H](CC(O)=O)NC(=O)[C@@H](NC(=O)[C@H](CCCCN)NC(=O)[C@@H](N)Cc1cnc[nH]1)[C@@H](C)O)C(C)C)C(N)=O
: