Target
Leukotriene B4 receptor 1
Ligand
BDBM50045092
Substrate
Meas. Tech.
ChEMBL_98505 (CHEMBL709167)
Ki
45±n/a nM
Citation
 Scott Sawyer, JBaldwin, RFFroelich, LLSaussy, DLJackson, WT Synthesis and pharmacologic activity of hydroxyacetophenone-substituted benzophenone/xanthone leukotriene B4 receptor antagonists Bioorg Med Chem Lett 3:1981-1984 (1993)    Article 
Target
Name:
Leukotriene B4 receptor 1
Synonyms:
BLT BLTR Chemoattractant receptor-like 1 GPR16 LTB4-R 1 Leukotriene B4 R1 Leukotriene B4 receptor 1 P2Y purinoceptor 7 | P2Y7
Type:
Enzyme Catalytic Domain
Mol. Mass.:
37582.68
Organism:
Homo sapiens (Human)
Description:
Q15722
Residue:
352
  
Inhibitor
Name:
BDBM50045092
Synonyms:
5-(2-Carboxy-ethyl)-6-[(E)-6-(4-methoxy-phenyl)-hex-5-enyloxy]-9-oxo-9H-xanthene-2-carboxylic acid CHEMBL49210 | LY-210073
Type:
Small organic molecule
Emp. Form.:
C30H28O8
Mol. Mass.:
516.5385
SMILES:
COc1ccc(\C=C\CCCCOc2ccc3c(oc4ccc(cc4c3=O)C(O)=O)c2CCC(O)=O)cc1
: