Target
Tubulin beta-2B chain
Ligand
BDBM50014846
Substrate
Meas. Tech.
ChEBML_211171
IC50
3500±n/a nM
Citation
 Andres, CBernardo, JYan, QHastie, SMacdonald, T Combretatroponeshybrids of combretastatin and colchicine. Synthesis and biochemical evaluation Bioorg Med Chem Lett 3:565-570 (1993)    Article 
Target
Name:
Tubulin beta-2B chain
Synonyms:
TBB2B_BOVIN Tubulin | Tubulin beta chain
Type:
PROTEIN
Mol. Mass.:
49932.38
Organism:
Bos taurus
Description:
ChEMBL_211651
Residue:
445
  
Inhibitor
Name:
BDBM50014846
Synonyms:
(S)-N-(5,6,7,9-tetrahydro-1,2,3,10-tetramethoxy-9-oxobenzo[a]heptalen-7-yl)acetamide 7alphaH-colchicine COLCHICINE colchicina | colchicinum
Type:
Small organic molecule
Emp. Form.:
C22H25NO6
Mol. Mass.:
399.437
SMILES:
COc1cc2CC[C@H](NC(C)=O)c3cc(=O)c(OC)ccc3-c2c(OC)c1OC
: