Target
Pepsin A
Ligand
BDBM50212827
Substrate
Meas. Tech.
ChEMBL_153973 (CHEMBL762325)
Ki
265±n/a nM
Citation
 Sawyer, TFisher, JHester, JSmith, CTomasselli, ATarpley, WBurton, PHui, JMcQuade, TConradi, RBradford, VLiu, LKinner, JTustin, JAlexander, DHarrison, AEmmert, DStaples, DMaggiora, LZhang, YPoorman, RDunna, BRao, CScarborough, PLowther, WCraik, CDeCamp, DMoon, JHowe, WHeinrikson, R Peptidomimetic inhibitors of human immunodeficiency virus protease (HIV-PR): Design, enzyme binding and selectivity, antiviral efficacy, and cell permeability properties Bioorg Med Chem Lett 3:819-824 (1993)    Article 
Target
Name:
Pepsin A
Synonyms:
PEPA_PIG Pepsin | Pepsin A precursor
Type:
Enzyme
Mol. Mass.:
41232.87
Organism:
Porcine
Description:
Residue:
385
  
Inhibitor
Name:
BDBM50212827
Synonyms:
CHEMBL3350189
Type:
Small organic molecule
Emp. Form.:
C45H61N7O7
Mol. Mass.:
812.0085
SMILES:
CC[C@H](C)[C@H](NC(=O)[C@H](C(C)C)[C@@H](O)[C@H](O)[C@H](CC1CCCCC1)NC(=O)[C@H](Cc1c[nH]cn1)NC(=O)COc1cccc2ccccc12)C(=O)NCc1ccccn1
: