Target
Gag-Pol polyprotein [489-587]
Ligand
BDBM50281641
Substrate
Meas. Tech.
ChEBML_157566
Ki
4±n/a nM
Citation
 Sawyer, TFisher, JHester, JSmith, CTomasselli, ATarpley, WBurton, PHui, JMcQuade, TConradi, RBradford, VLiu, LKinner, JTustin, JAlexander, DHarrison, AEmmert, DStaples, DMaggiora, LZhang, YPoorman, RDunna, BRao, CScarborough, PLowther, WCraik, CDeCamp, DMoon, JHowe, WHeinrikson, R Peptidomimetic inhibitors of human immunodeficiency virus protease (HIV-PR): Design, enzyme binding and selectivity, antiviral efficacy, and cell permeability properties Bioorg Med Chem Lett 3:819-824 (1993)    Article 
Target
Name:
Gag-Pol polyprotein [489-587]
Synonyms:
Human immunodeficiency virus type 1 protease Pol polyprotein | gag-pol
Type:
Enzyme Subunit
Mol. Mass.:
10781.16
Organism:
Human immunodeficiency virus type 1
Description:
P04585[489-587]
Residue:
99
  
Inhibitor
Name:
BDBM50281641
Synonyms:
(S)-N*1*-((1S,2S,4S)-1-Cyclohexylmethyl-2-hydroxy-5-methyl-4-{(S)-2-methyl-1-[(pyridin-2-ylmethyl)-carbamoyl]-butylcarbamoyl}-hexyl)-2-[2-(naphthalen-1-yloxy)-acetylamino]-succinamide | CHEMBL168093
Type:
Small organic molecule
Emp. Form.:
C43H60N6O7
Mol. Mass.:
772.9725
SMILES:
CCC(C)[C@H](NC(=O)[C@@H](C[C@H](O)[C@H](CC1CCCCC1)NC(=O)[C@H](CC(N)=O)NC(=O)COc1cccc2ccccc12)C(C)C)C(=O)NCc1ccccn1
: