Target
Gastrin/cholecystokinin type B receptor
Ligand
BDBM81962
Substrate
Meas. Tech.
ChEBML_48105
Ki
1.8±n/a nM
Citation
 Hill, DHorwell, DHunter, JKneen, CPritchard, MSuman-Chauhan, N Synthesis of a potent and selective non-peptide CCK-B/gastrin receptor antagonist tritiated ligand. Bioorg Med Chem Lett 3:885-888 (1993)    Article 
Target
Name:
Gastrin/cholecystokinin type B receptor
Synonyms:
CCK-2 receptor CCK-BR CCKRB Cholecystokinin receptor GASR_HUMAN | Gastrin/cholecystokinin type B receptor
Type:
G Protein-Coupled Receptor (GPCR)
Mol. Mass.:
48445.79
Organism:
Homo sapiens (Human)
Description:
Stable expression of human CCK-2 receptors in HEK 293 cells.
Residue:
447
  
Inhibitor
Name:
BDBM81962
Synonyms:
S-L-365,260
Type:
Emp. Form.:
C24H22N4O2
Mol. Mass.:
398.4571
SMILES:
CN1c2ccccc2C(=N[C@@H](NC(=O)Nc2cccc(C)c2)C1=O)c1ccccc1
: