Target
Angiotensin-converting enzyme
Ligand
BDBM50282861
Substrate
Meas. Tech.
ChEBML_34792
IC50
4±n/a nM
Citation
 Delaney, NGBarrish, JCNeubeck, RNatarajan, SCohen, MRovnyak, GCHuber, GMurugesan, NGirotra, RSieber-McMaster, ERobl, JAAsaad, MMCheung, HSBird, JWaldron, TPetrillo, EW Mercaptoacyl dipeptides as dual inhibitors of angiotensin-converting enzyme and neutral endopeptidase. Preliminary structure-activity studies Bioorg Med Chem Lett 4:1783-1788 (1994)    Article 
Target
Name:
Angiotensin-converting enzyme
Synonyms:
3.2.1.- ACE Angiotensin-converting enzyme, soluble form DCP1 Kininase II
Type:
Mol. Mass.:
150405.15
Organism:
Oryctolagus cuniculus
Description:
Residue:
1310
  
Inhibitor
Name:
BDBM50282861
Synonyms:
(S)-1-[(S)-2-((S)-2-Mercaptomethyl-3-phenyl-propionylamino)-propionyl]-pyrrolidine-2-carboxylic acid | CHEMBL299181
Type:
Small organic molecule
Emp. Form.:
C18H24N2O4S
Mol. Mass.:
364.459
SMILES:
C[C@H](NC(=O)[C@@H](CS)Cc1ccccc1)C(=O)N1CCC[C@H]1C(O)=O
: