Target
Angiotensin-converting enzyme 2
Ligand
BDBM21642
Substrate
Meas. Tech.
ChEMBL_35588 (CHEMBL876577)
IC50
10±n/a nM
Citation
 De Lombaert, STan, JStamford, LJSakane, YBerry, CGhai, RD Dual inhibition of neutral endopeptidase and angiotensin-converting enzyme by N-phosphonomethyl and N-carboxyalkyl dipeptides Bioorg Med Chem Lett 4:2715-2720 (1994)    Article 
Target
Name:
Angiotensin-converting enzyme 2
Synonyms:
ACEI-ACE2 | Angiotensin-converting enzyme
Type:
Mol. Mass.:
Description:
ASSAY_ID of EBI is 35589
Components:
This complex has 2 components.
Component 1
Name:
Angiotensin-converting enzyme
Synonyms:
ACE Angiotensin converting enzyme (ACE) Angiotensin-converting enzyme, soluble form CD_antigen=CD143 DCP1 Kininase II
Type:
Enzyme
Mol. Mass.:
149709.01
Organism:
Homo sapiens (Human)
Description:
Residue:
1306
  
Component 2
Name:
Angiotensin-converting enzyme 2
Synonyms:
ACE-related carboxypeptidase ACE2_HUMAN Angiotensin-converting enzyme homolog Metalloprotease MPROT15
Type:
Enzyme
Mol. Mass.:
92448.86
Organism:
Homo sapiens (Human)
Description:
Residue:
805
  
Inhibitor
Name:
BDBM21642
Synonyms:
(2S)-1-[(2S)-2-methyl-3-sulfanylpropanoyl]pyrrolidine-2-carboxylic acid Capozide Lopirin SQ14534 | US11491146, Compound L-Captopril
Type:
Small organic molecule
Emp. Form.:
C9H15NO3S
Mol. Mass.:
217.285
SMILES:
C[C@H](CS)C(=O)N1CCC[C@H]1C(O)=O
: