Target
5-hydroxytryptamine receptor 2A
Ligand
BDBM50283919
Substrate
Meas. Tech.
ChEMBL_201054 (CHEMBL805830)
IC50
18±n/a nM
Citation
 Damour, DBarreau, MDutruc-Rosset, GDoble, APiot, OMignani, S 1,1-diphenyl-3-dialkylamino-1-silacyclopentane derivatives: A new class of potent and selective 5-HT2A antagonists Bioorg Med Chem Lett 4:415-420 (1994)    Article 
Target
Name:
5-hydroxytryptamine receptor 2A
Synonyms:
5-HT-2A 5-HT2A 5-hydroxytryptamine receptor 2A (5HT2A) Htr2 Serotonin Receptor 2A
Type:
G Protein-Coupled Receptor (GPCR)
Mol. Mass.:
52852.05
Organism:
Rattus norvegicus (rat)
Description:
Rat cortex membranes 5-HT2A receptors.
Residue:
471
  
Inhibitor
Name:
BDBM50283919
Synonyms:
1-[1,1-Bis-(4-fluoro-phenyl)-silolan-3-yl]-4-(4-fluoro-phenyl)-piperazine | CHEMBL134964
Type:
Small organic molecule
Emp. Form.:
C26H27F3N2Si
Mol. Mass.:
452.5867
SMILES:
Fc1ccc(cc1)N1CCN(CC1)C1CC[Si](C1)(c1ccc(F)cc1)c1ccc(F)cc1
: