Target
Angiotensin-converting enzyme
Ligand
BDBM50285631
Substrate
Meas. Tech.
ChEMBL_35570 (CHEMBL648268)
IC50
20000±n/a nM
Citation
 Penning, TDAskonas, LJDjuric, SWHaack, RAYu, SSMichener, MLKrivi, GGPyla, E Kelatorphan and related analogs: potent and selective inhibitors of leukotriene A4 hydrolase Bioorg Med Chem Lett 5:2517-2522 (1995)    Article 
Target
Name:
Angiotensin-converting enzyme
Synonyms:
3.2.1.- ACE Angiotensin-converting enzyme, soluble form DCP1 Kininase II
Type:
Mol. Mass.:
150405.15
Organism:
Oryctolagus cuniculus
Description:
Residue:
1310
  
Inhibitor
Name:
BDBM50285631
Synonyms:
(S)-2-((S)-2-Benzyl-4-hydroxycarbamoyl-butyrylamino)-propionic acid | CHEMBL82343
Type:
Small organic molecule
Emp. Form.:
C15H20N2O5
Mol. Mass.:
308.3297
SMILES:
C[C@H](NC(=O)[C@@H](CCC(=O)NO)Cc1ccccc1)C(O)=O
: