Target
Angiotensin-converting enzyme
Ligand
BDBM50285633
Substrate
Meas. Tech.
ChEMBL_35570 (CHEMBL648268)
IC50
>100000±n/a nM
Citation
 Penning, TDAskonas, LJDjuric, SWHaack, RAYu, SSMichener, MLKrivi, GGPyla, E Kelatorphan and related analogs: potent and selective inhibitors of leukotriene A4 hydrolase Bioorg Med Chem Lett 5:2517-2522 (1995)    Article 
Target
Name:
Angiotensin-converting enzyme
Synonyms:
3.2.1.- ACE Angiotensin-converting enzyme, soluble form DCP1 Kininase II
Type:
Mol. Mass.:
150405.15
Organism:
Oryctolagus cuniculus
Description:
Residue:
1310
  
Inhibitor
Name:
BDBM50285633
Synonyms:
(R)-3-Benzyl-N-((S)-1-carboxy-ethyl)-succinamic acid | CHEMBL82898
Type:
Small organic molecule
Emp. Form.:
C14H17NO5
Mol. Mass.:
279.2885
SMILES:
C[C@H](NC(=O)[C@@H](CC(O)=O)Cc1ccccc1)C(O)=O
: