Target
Neprilysin
Ligand
BDBM50285637
Substrate
Meas. Tech.
ChEMBL_144462 (CHEMBL755109)
IC50
61000±n/a nM
Citation
 Penning, TDAskonas, LJDjuric, SWHaack, RAYu, SSMichener, MLKrivi, GGPyla, E Kelatorphan and related analogs: potent and selective inhibitors of leukotriene A4 hydrolase Bioorg Med Chem Lett 5:2517-2522 (1995)    Article 
Target
Name:
Neprilysin
Synonyms:
Atriopeptidase CD_antigen=CD10 MME NEP_RABIT Neutral endopeptidase 24.11
Type:
Enzyme
Mol. Mass.:
85570.75
Organism:
Oryctolagus cuniculus (rabbit)
Description:
NEP was purified to homogeneity from rabbit kidney.
Residue:
750
  
Inhibitor
Name:
BDBM50285637
Synonyms:
(R)-2-((R)-2-Benzyl-3-hydroxycarbamoyl-propionylamino)-4-methylsulfanyl-butyric acid | CHEMBL85430
Type:
Small organic molecule
Emp. Form.:
C16H22N2O5S
Mol. Mass.:
354.421
SMILES:
CSCC[C@@H](NC(=O)[C@@H](CC(=O)NO)Cc1ccccc1)C(O)=O
: