Target
Leukotriene A-4 hydrolase
Ligand
BDBM50285632
Substrate
Meas. Tech.
ChEMBL_96940 (CHEMBL706181)
IC50
3±n/a nM
Citation
 Penning, TDAskonas, LJDjuric, SWHaack, RAYu, SSMichener, MLKrivi, GGPyla, E Kelatorphan and related analogs: potent and selective inhibitors of leukotriene A4 hydrolase Bioorg Med Chem Lett 5:2517-2522 (1995)    Article 
Target
Name:
Leukotriene A-4 hydrolase
Synonyms:
LKHA4_HUMAN LTA4 Leukotriene A(4) hydrolase Leukotriene A4 hydrolase
Type:
Hydrolase; metalloprotease
Mol. Mass.:
69280.41
Organism:
Homo sapiens (Human)
Description:
Human recombinant LTA4H.
Residue:
611
  
Inhibitor
Name:
BDBM50285632
Synonyms:
(S)-2-[((R)-2-Benzyl-3-hydroxycarbamoyl-propionyl)-methyl-amino]-propionic acid | CHEMBL86211
Type:
Small organic molecule
Emp. Form.:
C15H20N2O5
Mol. Mass.:
308.3297
SMILES:
C[C@H](N(C)C(=O)[C@@H](CC(=O)NO)Cc1ccccc1)C(O)=O
: