Target
HLA class II histocompatibility antigen, DR beta 3 chain
Ligand
BDBM50287628
Substrate
Meas. Tech.
ChEBML_47860
IC50
170±n/a nM
Citation
 Hanson, GJVuletich, JLBedell, LJBono, CPHoward, SCWelply, JKWoulfe, SLZacheis, ML Design of MHC class II (DR4) ligands using conformationally restricted imino acids at p3 and p5 Bioorg Med Chem Lett 6:1931-1936 (1996)    Article 
Target
Name:
HLA class II histocompatibility antigen, DR beta 3 chain
Synonyms:
DRB3_HUMAN HLA class II histocompatibility antigen, DRB3-1 beta chain Human leukocyte antigen DR beta chain | MHC class I antigen DRB3*1
Type:
PROTEIN
Mol. Mass.:
29969.73
Organism:
Homo sapiens (Human)
Description:
ChEMBL_47860
Residue:
266
  
Inhibitor
Name:
BDBM50287628
Synonyms:
(S)-3-({1-[(S)-2-(3-Cyclohexyl-propionylamino)-3-methyl-butyryl]-piperidine-2-carbonyl}-amino)-4-[(S)-2-((1S,2R)-2-hydroxy-1-propylcarbamoyl-propylcarbamoyl)-pyrrolidin-1-yl]-4-oxo-butyric acid | CHEMBL2373029
Type:
Small organic molecule
Emp. Form.:
C40H66N6O9
Mol. Mass.:
774.9868
SMILES:
CCCNC(=O)[C@@H](NC(=O)[C@@H]1CCCN1C(=O)[C@H](CC(O)=O)NC(=O)[C@@H]1CCCCN1C(=O)[C@@H](NC(=O)C[C@H](C)C1CCCCC1)C1CCCCC1)[C@@H](C)O
: