Target
HLA class II histocompatibility antigen, DR beta 3 chain
Ligand
BDBM50287637
Substrate
Meas. Tech.
ChEBML_47860
IC50
31±n/a nM
Citation
 Hanson, GJVuletich, JLBedell, LJBono, CPHoward, SCWelply, JKWoulfe, SLZacheis, ML Design of MHC class II (DR4) ligands using conformationally restricted imino acids at p3 and p5 Bioorg Med Chem Lett 6:1931-1936 (1996)    Article 
Target
Name:
HLA class II histocompatibility antigen, DR beta 3 chain
Synonyms:
DRB3_HUMAN HLA class II histocompatibility antigen, DRB3-1 beta chain Human leukocyte antigen DR beta chain | MHC class I antigen DRB3*1
Type:
PROTEIN
Mol. Mass.:
29969.73
Organism:
Homo sapiens (Human)
Description:
ChEMBL_47860
Residue:
266
  
Inhibitor
Name:
BDBM50287637
Synonyms:
(S)-3-{(S)-2-[(S)-2-((S)-2-Acetylamino-3-naphthalen-1-yl-propionylamino)-5-guanidino-pentanoylamino]-propionylamino}-N-{(S)-1-[(1S,2R)-1-((S)-1-carbamoyl-3-methyl-butylcarbamoyl)-2-hydroxy-propylcarbamoyl]-ethyl}-succinamic acid SC-64762
Type:
Small organic molecule
Emp. Form.:
C41H61N11O11
Mol. Mass.:
883.9901
SMILES:
CC(C)C[C@H](NC(=O)[C@@H](NC(=O)[C@H](C)NC(=O)[C@H](CC(O)=O)NC(=O)[C@H](C)NC(=O)[C@H](CCCNC(N)=N)NC(=O)[C@H](Cc1cccc2ccccc12)NC(C)=O)[C@@H](C)O)C(N)=O
: