Target
Acetylcholinesterase
Ligand
BDBM50093799
Substrate
Meas. Tech.
ChEBML_27824
Ki
17±n/a nM
Citation
 Kozikowski, APDing, QSaxena, ADoctor, BP Synthesis of ()-10,10-dimethylhuperzine A a huperzine analogue possessing a slower enzyme off-rate Bioorg Med Chem Lett 6:259-262 (1996)    Article 
Target
Name:
Acetylcholinesterase
Synonyms:
ACES_BOVIN Acetylcholinesterase (AChE) | Acetylcholinesterase precursor
Type:
Enzyme
Mol. Mass.:
67659.62
Organism:
Bos taurus (bovine)
Description:
Residue:
613
  
Inhibitor
Name:
BDBM50093799
Synonyms:
(R)-1-Amino-13-eth-(E)-ylidene-8,8,11-trimethyl-6-aza-tricyclo[7.3.1.0*2,7*]trideca-2(7),3,10-trien-5-one CHEMBL79874
Type:
Small organic molecule
Emp. Form.:
C17H22N2O
Mol. Mass.:
270.3694
SMILES:
C\C=C1/C2C=C(C)C[C@]1(N)c1ccc(=O)[nH]c1C2(C)C
: