Target
Serine protease 1
Ligand
BDBM50069922
Substrate
Meas. Tech.
ChEMBL_210664 (CHEMBL812715)
Ki
0.045±n/a nM
Citation
 Dominguez, CCarini, DWeber, PKnabb, RAlexander, RKettner, CWexler, R S1 heterocyclic thrombin inhibitors Bioorg Med Chem Lett 7:79-84 (1997)    Article 
Target
Name:
Serine protease 1
Synonyms:
Alpha-trypsin chain 1 Beta-trypsin PRSS1 TRP1 TRY1_HUMAN Thrombin & trypsin Trypsin I | Trypsin-1
Type:
Enzyme
Mol. Mass.:
26557.80
Organism:
Homo sapiens (Human)
Description:
P07477
Residue:
247
  
Inhibitor
Name:
BDBM50069922
Synonyms:
Boropeptide analogue | CHEMBL102069
Type:
Small organic molecule
Emp. Form.:
C21H33BN6O5
Mol. Mass.:
460.335
SMILES:
CC(=O)NC(Cc1ccccc1)C(=O)N1CCC[C@H]1C(=O)NC(CCCNC(N)=N)B(O)O
: