Target
D(3) dopamine receptor
Ligand
BDBM50290220
Substrate
Meas. Tech.
ChEBML_58772
Ki
4.7±n/a nM
Citation
 Belliotti, TRKesten, SRRubin, JRWustrow, DJGeorgic, LMZoski, KTAkunne, HCWise, LD Novel cyclohexyl amides as potent and selective D3 dopamine receptor ligands Bioorg Med Chem Lett 7:2403-2408 (1997)    Article 
Target
Name:
D(3) dopamine receptor
Synonyms:
DOPAMINE D3 DRD3_HUMAN Dopamine D3 receptor (D3) Dopamine receptor Dopamine receptor D3
Type:
Mol. Mass.:
44243.43
Organism:
Homo sapiens (Human)
Description:
Residue:
400
  
Inhibitor
Name:
BDBM50290220
Synonyms:
CHEMBL430439 | N-(4-{2-[4-(2,3-Dichloro-phenyl)-piperazin-1-yl]-ethyl}-cyclohexyl)-benzamide
Type:
Small organic molecule
Emp. Form.:
C25H31Cl2N3O
Mol. Mass.:
460.439
SMILES:
Clc1cccc(N2CCN(CC[C@H]3CC[C@@H](CC3)NC(=O)c3ccccc3)CC2)c1Cl
: