Target
D(2) dopamine receptor
Ligand
BDBM50290209
Substrate
Meas. Tech.
ChEBML_58455
Ki
12±n/a nM
Citation
 Belliotti, TRKesten, SRRubin, JRWustrow, DJGeorgic, LMZoski, KTAkunne, HCWise, LD Novel cyclohexyl amides as potent and selective D3 dopamine receptor ligands Bioorg Med Chem Lett 7:2403-2408 (1997)    Article 
Target
Name:
D(2) dopamine receptor
Synonyms:
D(2) dopamine receptor DOPAMINE D2 Long DRD2 Dopamine D2 receptor Dopamine D2 receptor (D2R) Dopamine2-like | d2
Type:
Cell-surface receptors
Mol. Mass.:
50647.10
Organism:
Homo sapiens (Human)
Description:
P14416
Residue:
443
  
Inhibitor
Name:
BDBM50290209
Synonyms:
CHEMBL310577 | Thiophene-2-carboxylic acid (4-{2-[4-(3-methoxy-phenyl)-piperazin-1-yl]-ethyl}-cyclohexyl)-amide
Type:
Small organic molecule
Emp. Form.:
C24H33N3O2S
Mol. Mass.:
427.603
SMILES:
COc1cccc(c1)N1CCN(CC[C@H]2CC[C@@H](CC2)NC(=O)c2cccs2)CC1
: