Target
D(2) dopamine receptor
Ligand
BDBM50290206
Substrate
Meas. Tech.
ChEBML_58455
Ki
1±n/a nM
Citation
 Belliotti, TRKesten, SRRubin, JRWustrow, DJGeorgic, LMZoski, KTAkunne, HCWise, LD Novel cyclohexyl amides as potent and selective D3 dopamine receptor ligands Bioorg Med Chem Lett 7:2403-2408 (1997)    Article 
Target
Name:
D(2) dopamine receptor
Synonyms:
D(2) dopamine receptor DOPAMINE D2 Long DRD2 Dopamine D2 receptor Dopamine D2 receptor (D2R) Dopamine2-like | d2
Type:
Cell-surface receptors
Mol. Mass.:
50647.10
Organism:
Homo sapiens (Human)
Description:
P14416
Residue:
443
  
Inhibitor
Name:
BDBM50290206
Synonyms:
CHEMBL78800 | Thiophene-2-carboxylic acid (4-{2-[4-(2-chloro-phenyl)-piperazin-1-yl]-ethyl}-cyclohexyl)-amide
Type:
Small organic molecule
Emp. Form.:
C23H30ClN3OS
Mol. Mass.:
432.022
SMILES:
Clc1ccccc1N1CCN(CC[C@H]2CC[C@@H](CC2)NC(=O)c2cccs2)CC1
: