Target
Sodium channel protein type 1/2/3 subunit alpha
Ligand
BDBM50290406
Substrate
Meas. Tech.
ChEBML_144902
IC50
500±n/a nM
Citation
 Schow, SRossignol, DLund, ASchnee, M Batrachotoxin binding site antagonists Bioorg Med Chem Lett 7:181-186 (1997)    Article 
Target
Name:
Sodium channel protein type 1/2/3 subunit alpha
Synonyms:
Sodium channel alpha subunits; brain (Types I, II, III) | Sodium channel protein type I I alpha subunit
Type:
Mol. Mass.:
Description:
ASSAY_ID of EBI is 68595
Components:
This complex has 3 components.
Component 1
Name:
Sodium channel protein type 1 subunit alpha
Synonyms:
NAC1 SCN1A Sodium (Site 1) Sodium channel protein type 1 subunit alpha Sodium channel protein type I subunit alpha Voltage-gated sodium channel subunit alpha Nav1.1
Type:
Protein
Mol. Mass.:
228952.47
Organism:
Homo sapiens (Human)
Description:
P35498
Residue:
2009
  
Component 2
Name:
Sodium channel protein type 2 subunit alpha
Synonyms:
HBSC II SCN2A SCN2A2 Sodium (Site 2) Sodium channel protein type 2 alpha subunit Voltage-gated sodium channel subunit alpha Nav1.2
Type:
Enzyme
Mol. Mass.:
227954.68
Organism:
Homo sapiens (Human)
Description:
Q99250
Residue:
2005
  
Component 3
Name:
Sodium channel protein type 3 subunit alpha
Synonyms:
KIAA1356 NAC3 SCN3A_HUMAN Sodium channel alpha subunits; brain (Types I, II, III) Voltage-gated sodium channel subunit alpha Nav1.3 (Nav1.3)
Type:
Protein
Mol. Mass.:
226276.42
Organism:
Homo sapiens (Human)
Description:
Q9NY46
Residue:
2000
  
Inhibitor
Name:
BDBM50290406
Synonyms:
Benzoic acid 3-dimethylaminomethyl-5-hydroxy-5-(1-methoxy-8-methyl-2-oxa-tricyclo[5.3.1.0*3,8*]undec-3-yl)-pentyl ester | CHEMBL52359
Type:
Small organic molecule
Emp. Form.:
C27H41NO5
Mol. Mass.:
459.6181
SMILES:
CO[C@]12CCC3(C)C(CCC[C@]3(O1)[C@H](O)C[C@@H](CCOC(=O)c1ccccc1)CN(C)C)C2
: