Target
Delta-type opioid receptor
Ligand
BDBM50290870
Substrate
Meas. Tech.
ChEBML_53570
Ki
3±n/a nM
Citation
 Dondio, GRonzoni, SPetrillo, PDesJarlais, RLRaveglia, LF Pyrrolooctahydroisoquinolines as potent and selective opioid receptor ligands: SAR analysis and docking studies Bioorg Med Chem Lett 7:2967-2972 (1997)    Article 
Target
Name:
Delta-type opioid receptor
Synonyms:
DOR-1 MSL-2 OPRD_MOUSE Oprd1
Type:
Enzyme Catalytic Domain
Mol. Mass.:
40577.25
Organism:
MOUSE
Description:
P32300
Residue:
372
  
Inhibitor
Name:
BDBM50290870
Synonyms:
(4aR,8aR)-4a-(3-Hydroxy-phenyl)-3,7-dimethyl-4,4a,5,6,7,8,8a,9-octahydro-1H-pyrrolo[3,2-g]isoquinoline-2-carboxylic acid diethylamide | CHEMBL316863
Type:
Small organic molecule
Emp. Form.:
C24H33N3O2
Mol. Mass.:
395.5377
SMILES:
CCN(CC)C(=O)c1[nH]c2C[C@H]3CN(C)CC[C@@]3(Cc2c1C)c1cccc(O)c1
: